{"text_format":"1","workbook":"xlsx","n_sheets":7,"sheets":["Cadastros","Base Acidentes","Base DDS","Dash.Acidentes","Dash DDS","Instruções","Apoio"],"not_rendered":{"charts":9,"images":30,"macros":1,"external_links":0,"defined_names":12,"comments":0,"pivot_tables":9},"unopened":[],"bounds":{"document_bytes":16777216,"sheet_cells":100000,"rows_first":2000,"rows_last":500,"rows_between":2000,"halvings":0,"cell_chars":16384,"cell_head_chars":4096},"cells_cut":0,"cells_raw":0,"read":"row_number_cap","date_system":"1900"}

{"sheet":"Cadastros","index":0,"n_rows":56,"n_cols":10,"rows_kept":56,"cut":false,"hidden":false,"merged":[[3,3,3,7]]}
[]
[]
[]
[null,"Cadastro de base Geral",null,"Cadastro da base de acidentes",null,null,null,null,null,"Cadastro de base DDS"]
[null,"Setor",null,"Agente da lesão",null,"Caracterização de Acidentes",null,"Partes do corpo",null,"Método"]
[null,"Operacional",null,"Acidente de carro",null,"Incapacitante",null,"Crânio",null,"Book DDs"]
[null,"Adminstrativo",null,"Acidente de moto",null,"Não incapacitante",null,"Face",null,"Vídeo"]
[null,"Financeiro",null,"Choque",null,"Com restrição",null,"Olhos",null,"Palestra"]
[null,"Comercial",null,"Manipulação de ferramentas",null,"Sem restrição",null,"Pescoço",null,"Power Point"]
[null,"Usinagem",null,"Queda de escada",null,"Com danos materiais",null,"Ombro"]
{"$rows_left_out":47}
{"sheet":"Base Acidentes","index":1,"n_rows":23,"n_cols":24,"rows_kept":23,"cut":false,"hidden":false,"merged":[]}
[]
[]
[null,null,null,null,null,null,null,null,null,null,null,null,null,null,null,null,null,null,null,null,null,null,null,{"$error":"#N/A"}]
[]
[]
[null,"Data","Nº de Registro do funcionário","Nome do Funcionário","Setor","Função","Sexo","Turno","Tipo de acidente","Agente de lesão","Caracterização do acidente","Parte do corpo atingida","Dias de afastamento","Valor gerado","Mês","Ano"]
[null,44927,1015,"Nome do funcionário 1","Operacional","Função","Masculino","Tarde","Acidente Típico","Acidente de carro","Incapacitante","Face",20,500,{"$f":"IF(TbBaseAcidentes[[#This Row],[Data]]=\"\",\"\",PROPER(TEXT(TbBaseAcidentes[[#This Row],[Data]],\"mmm\")))","v":"Jan"},{"$f":"IF(TbBaseAcidentes[[#This Row],[Data]]=\"\",\"\",YEAR(TbBaseAcidentes[[#This Row],[Data]]))","v":2023}]
[null,44958,2015,"Nome do funcionário 2","Adminstrativo","Função","Feminino","Noite","Acidente de trajeto","Acidente de moto","Não incapacitante","Dedos Pé",5,20,{"$f":"IF(TbBaseAcidentes[[#This Row],[Data]]=\"\",\"\",PROPER(TEXT(TbBaseAcidentes[[#This Row],[Data]],\"mmm\")))","v":"Fev"},{"$f":"IF(TbBaseAcidentes[[#This Row],[Data]]=\"\",\"\",YEAR(TbBaseAcidentes[[#This Row],[Data]]))","v":2023}]
[null,44986,2023,"Nome do funcionário 3","Financeiro","Função","Masculino","Manhã","Acidente Típico","Choque","Fatal","Orgãos internos",20,300,{"$f":"IF(TbBaseAcidentes[[#This Row],[Data]]=\"\",\"\",PROPER(TEXT(TbBaseAcidentes[[#This Row],[Data]],\"mmm\")))","v":"Mar"},{"$f":"IF(TbBaseAcidentes[[#This Row],[Data]]=\"\",\"\",YEAR(TbBaseAcidentes[[#This Row],[Data]]))","v":2023}]
[null,45108,1050,"Nome do funcionário 4","Comercial","Função","Masculino","Noite","Doença Ocupacional","Choque","Com danos materiais","Pé",2,100,{"$f":"IF(TbBaseAcidentes[[#This Row],[Data]]=\"\",\"\",PROPER(TEXT(TbBaseAcidentes[[#This Row],[Data]],\"mmm\")))","v":"Jul"},{"$f":"IF(TbBaseAcidentes[[#This Row],[Data]]=\"\",\"\",YEAR(TbBaseAcidentes[[#This Row],[Data]]))","v":2023}]
{"$rows_left_out":14}
{"sheet":"Base DDS","index":2,"n_rows":33,"n_cols":24,"rows_kept":33,"cut":false,"hidden":false,"merged":[]}
[]
[]
[null,null,null,null,null,null,null,null,null,null,null,null,null,null,null,null,null,null,null,null,null,null,null,{"$error":"#N/A"}]
[]
[]
[null,"Data","Tema do DDS","Método utilizado","Qtd total de Colaboradores","Qtd. de participantes","% de Participação","Comentários","Mês","Ano"]
[null,44927,"Tema ","Book DDs",30,30,{"$f":"IF(OR(TbBaseDDS[[#This Row],[Qtd total de Colaboradores]]=\"\",TbBaseDDS[[#This Row],[Qtd. de participantes]]=\"\"),\"\",TbBaseDDS[[#This Row],[Qtd. de participantes]]/TbBaseDDS[[#This Row],[Qtd total de Colaboradores]])","v":1},null,{"$f":"IF(TbBaseDDS[[#This Row],[Data]]=\"\",\"\",PROPER(TEXT(TbBaseDDS[[#This Row],[Data]],\"mmm\")))","v":"Jan"},{"$f":"IF(TbBaseDDS[[#This Row],[Data]]=\"\",\"\",YEAR(TbBaseDDS[[#This Row],[Data]]))","v":2023}]
[null,44958,"Tema ","Vídeo",20,20,{"$f":"IF(OR(TbBaseDDS[[#This Row],[Qtd total de Colaboradores]]=\"\",TbBaseDDS[[#This Row],[Qtd. de participantes]]=\"\"),\"\",TbBaseDDS[[#This Row],[Qtd. de participantes]]/TbBaseDDS[[#This Row],[Qtd total de Colaboradores]])","v":1},null,{"$f":"IF(TbBaseDDS[[#This Row],[Data]]=\"\",\"\",PROPER(TEXT(TbBaseDDS[[#This Row],[Data]],\"mmm\")))","v":"Fev"},{"$f":"IF(TbBaseDDS[[#This Row],[Data]]=\"\",\"\",YEAR(TbBaseDDS[[#This Row],[Data]]))","v":2023}]
[null,44986,"Tema ","Palestra",20,18,{"$f":"IF(OR(TbBaseDDS[[#This Row],[Qtd total de Colaboradores]]=\"\",TbBaseDDS[[#This Row],[Qtd. de participantes]]=\"\"),\"\",TbBaseDDS[[#This Row],[Qtd. de participantes]]/TbBaseDDS[[#This Row],[Qtd total de Colaboradores]])","v":0.9},null,{"$f":"IF(TbBaseDDS[[#This Row],[Data]]=\"\",\"\",PROPER(TEXT(TbBaseDDS[[#This Row],[Data]],\"mmm\")))","v":"Mar"},{"$f":"IF(TbBaseDDS[[#This Row],[Data]]=\"\",\"\",YEAR(TbBaseDDS[[#This Row],[Data]]))","v":2023}]
[null,45017,"Tema ","Power Point",30,25,{"$f":"IF(OR(TbBaseDDS[[#This Row],[Qtd total de Colaboradores]]=\"\",TbBaseDDS[[#This Row],[Qtd. de participantes]]=\"\"),\"\",TbBaseDDS[[#This Row],[Qtd. de participantes]]/TbBaseDDS[[#This Row],[Qtd total de Colaboradores]])","v":0.83333333333333337},null,{"$f":"IF(TbBaseDDS[[#This Row],[Data]]=\"\",\"\",PROPER(TEXT(TbBaseDDS[[#This Row],[Data]],\"mmm\")))","v":"Abr"},{"$f":"IF(TbBaseDDS[[#This Row],[Data]]=\"\",\"\",YEAR(TbBaseDDS[[#This Row],[Data]]))","v":2023}]
{"$rows_left_out":24}
{"sheet":"Dash.Acidentes","index":3,"n_rows":0,"n_cols":0,"rows_kept":0,"cut":false,"hidden":false,"merged":[],"read":"row_number_cap"}

{"sheet":"Dash DDS","index":4,"n_rows":0,"n_cols":0,"rows_kept":0,"cut":false,"hidden":false,"merged":[]}

{"sheet":"Instruções","index":5,"n_rows":39,"n_cols":24,"rows_kept":39,"cut":false,"hidden":false,"merged":[[37,1,37,19],[39,1,39,19],[38,0,38,22],[24,1,24,20],[31,1,31,19],[32,1,32,19],[33,1,33,19],[34,1,34,19],[35,1,35,19],[36,1,36,19],[25,1,25,19],[26,1,26,19],[27,1,27,19],[28,1,28,19],[29,1,29,19],[30,1,30,19],[3,1,3,22],[13,1,13,22],[21,1,21,22],[11,1,11,20],[23,1,23,20],[22,1,22,20],[5,1,5,20],[6,1,6,20],[4,1,4,20]]}
[]
[]
[null,null,null,null,null,null,null,null,null,null,null,null,null,null,null,null,null,null,null,null,null,null,null,{"$error":"#N/A"}]
[null,"REGRAS PARA USO"]
[null,"Muito obrigado por adquirir este produto. É uma grande satisfação tê-lo como cliente."]
[null,"Esta planilha foi planejada e desenvolvida de forma que fosse uma forma prática e fácil para conseguir controlar seu projeto."]
[null,"Qualquer dúvida, por favor entrar em contato com : contato@almeidaplanilhas.com.br"]
[]
[null,"Planilha 100% editável, para que você possa deixar do jeito que deseja."]
[]
{"$rows_left_out":30}
{"sheet":"Apoio","index":6,"n_rows":53,"n_cols":84,"rows_kept":53,"cut":false,"hidden":true,"merged":[[12,6,12,7],[1,1,1,7],[5,6,5,7],[6,6,6,7],[7,6,7,7],[8,5,8,7],[11,5,11,7],[2,5,2,7],[3,6,3,7],[4,5,4,7],[1,9,1,14],[1,50,1,53],[1,32,1,48],[0,55,0,83],[0,1,0,53],[1,16,1,19],[1,26,1,30],[1,21,1,24],[1,63,1,70],[1,82,1,83],[1,56,1,61],[1,72,1,80]]}
[null,"Acidentes de trabalho"]
[null,"CAIXAS",null,null,null,null,null,null,null,"TIPOS DE ACIDENTES",null,null,null,null,null,null,"TOP 3 - AGENTES DE LESÃO",null,null,null,null,"TOP 3 - CARACTERIZAÇÃO DO ACIDENTE",null,null,null,null,"ACIDENTES POR SETOR",null,null,null,null,null,"PARTES DO CORPO",null,null,null,null,null,null,null,null,null,null,null,null,null,null,null,null,null,"ACIDENTES DURANTE O ANO",null,null,null,null,null,"CAIXAS",null,null,null,null,null,null,"MÉTODO UTILIZADO",null,null,null,null,null,null,null,null,"Colaboradores x participantes e % de participação",null,null,null,null,null,null,null,null,null,"DDS Realizado"]
[null,"Turno","Sexo","Qtd","Valor","ACIDENTES",null,null,null,"Tipo de acidente","Qtd","Tipos de acidente","Qtd","%","% rest.",null,"Agente de lesão","QTD","Agente de lesão","Qtd",null,"Caracterização do acidente","qtd","Caracterização do acidente","qtd",null,"Setor","Qtd",0,"Setor","Qtd",null,"Parte do corpo atingida","qtd","Padrão","Qtd","Partes do corpo","Qtd",null,"ID","Outras partes","Qtd","P.I","P.F","P.F2","ID","Outras partes ordem","Outras partes","QTD",null,"Mês","QTD","Mês","Qtd",null,null,"Método utilizado","Qtd DDS","total de Colaboradores","Qtd. de participantes ","Qtd de DDS",{"$f":"SUM($BF$4:$BF$20)","v":27},null,"ID","Método utlizado","QTD","P.I","P.F",0,"Método utlizado","QTD",null,"Mês","QTD de DDS","Qtd total de Colaboradores ","Qtd. de participantes ","ID","Mês","Colaboradores","Participantes","%",null,"Mês","Qtd"]
[null,"Tarde","Feminino",2,50,"Acidentes",{"$f":"SUM($G$6:$G$8)","v":17},null,null,"Acidente de trajeto",5,"Acidente típico",{"$f":"SUMIF($J$4:$J$10,L4,$K$4:$K$10)","v":6},{"$f":"IF($M$7=0,0,M4/$M$7)","v":0.35294117647058826},{"$f":"1-N4","v":0.64705882352941169},null,"Choque",5,{"$f":"IF(Q4=\"\",\"\",Q4)","v":"Choque"},{"$f":"IF(R4=\"\",\"\",R4)","v":5},null,"Com danos materiais",5,{"$f":"IF(V4=\"\",\"\",V4)","v":"Com danos materiais"},{"$f":"IF(W4=\"\",\"\",W4)","v":5},null,"Pintura",5,{"$f":"(AC3*7)+1","v":1},{"$f":"IFERROR(IF(INDEX($AA$4:$AB$55,$AC4,1)=0,\" \",INDEX($AA$4:$AB$55,$AC4,1)),\" \")","v":"Pintura"},{"$f":"IFERROR(IF(INDEX($AA$4:$AB$55,$AC4,2)=0,0,INDEX($AA$4:$AB$55,$AC4,2)),\"\")","v":5},null,"Face",1,"Crânio",{"$f":"SUMIF($AG$4:$AG$70,AI4,$AH$4:$AH$70)","v":2},{"$f":"IF(AJ4=0,\"\",AI4)","v":"Crânio"},{"$f":"IF(AJ4=0,\"\",AJ4)","v":2},null,1,{"$f":"IFERROR(INDEX(Lista_PartesCorpo,AN4,1),\"\")","v":"Crânio"},{"$f":"IF(AO4=\"\",\"\",IF(ISERROR(MATCH(AO4,$AI$4:$AI$15,0)),SUMIF($AG$4:$AG$100,AO4,$AH$4:$AH$100),0))","v":0},{"$f":"IF(OR(AP4=\"\",AP4=0),\"\",RANK(AP4,$AP$4:$AP$53,0))","v":""},{"$f":"IFERROR(IF(COUNTIF($AQ$3:AQ3,AQ4)>0,AQ4+COUNTIF($AQ$3:AQ3,AQ4),AQ4),\"\")","v":""},{"$f":"IF(AR4=\"\",\"\",IF(AR4>10,\"OK\",AR4))","v":""},{"$f":"IF(AU4=\"\",\"\",COUNTA(AT$3:$AT3)-COUNTBLANK(AT$3:$AT3))","v":1},{"$f":"IFERROR(INDEX($AO$4:$AP$53,MATCH(AN4,$AS$4:$AS$53,0),1),\"\")","v":"Joelho"},{"$f":"IFERROR(INDEX($AU$4:$AU$14,MATCH(AN4,$AT$4:$AT$14,0),1),\"\")","v":"Joelho"},{"$f":"IF(AV4=\"\",\"\",\nIF(AV4<>\"outros\",SUMIF($AO$4:$AO$53,AV4,$AP$4:$AP$53),SUMIF($AS$4:$AS$53,\"ok\",$AP$4:$AP$53)))","v":3},null,"Jan",1,"Jan",{"$f":"SUMIF($AY$4:$AY$20,BA4,$AZ$4:$AZ$20)","v":1},null,null,"Book DDs",6,210,170,"Média de Colaboradores Previstos",{"$f":"IFERROR(ROUNDUP(SUM($BG$4:$BG$20)/$BJ$3,0),0)","v":33},null,1,{"$f":"IFERROR(INDEX(Lista_Metodo,Apoio!BL4,1),\"\")","v":"Book DDs"},{"$f":"IF(BM4=\"\",\"\",SUMIF($BE$4:$BE$20,BM4,$BF$4:$BF$20))","v":6},{"$f":"IF(OR(BM4=\"\",BN4=0),\"\",RANK(BN4,$BN$4:$BN$13,0))","v":2},{"$f":"IFERROR(IF(COUNTIF($BO$3:BO3,BO4)>0,BO4+COUNTIF($BO$3:BO3,BO4),BO4),\"\")","v":2},{"$f":"(BQ3*4)+1","v":1},{"$f":"IFERROR(INDEX($BM$4:$BN$13,MATCH($BQ4,$BP$4:$BP$13,0),1),\" \")","v":"Vídeo"},{"$f":"IF(BR4=\"\",\"\",SUMIF($BM$4:$BM$13,BR4,$BN$4:$BN$13))","v":9},null,"Jan",5,180,167,1,"Jan",{"$f":"IFERROR(ROUNDUP(SUMIF($BU$4:$BU$20,$BZ4,$BW$4:$BW$20)/SUMIF($BU$4:$BU$20,$BZ4,$BV$4:$BV$20),0),0)","v":36},{"$f":"IFERROR(ROUNDDOWN(SUMIF($BU$4:$BU$20,$BZ4,$BX$4:$BX$20)/SUMIF($BU$4:$BU$20,$BZ4,$BV$4:$BV$20),0),0)","v":33},{"$f":"IFERROR(IF(CA4=0,0,CB4/CA4),0)","v":0.91666666666666663},null,"Jan",{"$f":"SUMIF($BU$4:$BU$20,$BZ4,$BV$4:$BV$20)","v":5}]
[null,"Tarde","Masculino",1,500,"TURNO",null,null,null,"Acidente Típico",6,"Acidente de trajeto",{"$f":"SUMIF($J$4:$J$10,L5,$K$4:$K$10)","v":5},{"$f":"IF($M$7=0,0,M5/$M$7)","v":0.29411764705882354},{"$f":"1-N5","v":0.70588235294117641},null,"Acidente de carro",4,{"$f":"IF(Q5=\"\",\"\",Q5)","v":"Acidente de carro"},{"$f":"IF(R5=\"\",\"\",R5)","v":4},null,"Sem danos materiais",3,{"$f":"IF(V5=\"\",\"\",V5)","v":"Sem danos materiais"},{"$f":"IF(W5=\"\",\"\",W5)","v":3},null,"Montagem",4,{"$f":"AC4+1","v":2},{"$f":"IFERROR(IF(INDEX($AA$4:$AB$55,$AC5,1)=0,\" \",INDEX($AA$4:$AB$55,$AC5,1)),\" \")","v":"Montagem"},{"$f":"IFERROR(IF(INDEX($AA$4:$AB$55,$AC5,2)=0,0,INDEX($AA$4:$AB$55,$AC5,2)),\"\")","v":4},null,"Joelho",3,"Face",1,{"$f":"IF(AJ5=0,\"\",AI5)","v":"Face"},{"$f":"IF(AJ5=0,\"\",AJ5)","v":1},null,2,"Face",0,{"$f":"IF(OR(AP5=\"\",AP5=0),\"\",RANK(AP5,$AP$4:$AP$53,0))","v":""},{"$f":"IFERROR(IF(COUNTIF($AQ$3:AQ4,AQ5)>0,AQ5+COUNTIF($AQ$3:AQ4,AQ5),AQ5),\"\")","v":""},{"$f":"IF(AR5=\"\",\"\",IF(AR5>10,\"OK\",AR5))","v":""},{"$f":"IF(AU5=\"\",\"\",COUNTA(AT$3:$AT4)-COUNTBLANK(AT$3:$AT4))","v":2},"Cotovelo",{"$f":"IFERROR(INDEX($AU$4:$AU$14,MATCH(AN5,$AT$4:$AT$14,0),1),\"\")","v":"Cotovelo"},{"$f":"IF(AV5=\"\",\"\",\nIF(AV5<>\"outros\",SUMIF($AO$4:$AO$53,AV5,$AP$4:$AP$53),SUMIF($AS$4:$AS$53,\"ok\",$AP$4:$AP$53)))","v":1},null,"Fev",2,"Fev",{"$f":"SUMIF($AY$4:$AY$20,BA5,$AZ$4:$AZ$20)","v":2},null,null,"Palestra",6,200,178,"Média de participantes",{"$f":"IFERROR(ROUNDDOWN(SUM($BH$4:$BH$20)/$BJ$3,0),0)","v":27},null,2,{"$f":"IFERROR(INDEX(Lista_Metodo,Apoio!BL5,1),\"\")","v":"Vídeo"},{"$f":"IF(BM5=\"\",\"\",SUMIF($BE$4:$BE$20,BM5,$BF$4:$BF$20))","v":9},{"$f":"IF(OR(BM5=\"\",BN5=0),\"\",RANK(BN5,$BN$4:$BN$13,0))","v":1},{"$f":"IFERROR(IF(COUNTIF($BO$3:BO4,BO5)>0,BO5+COUNTIF($BO$3:BO4,BO5),BO5),\"\")","v":1},{"$f":"BQ4+1","v":2},{"$f":"IFERROR(INDEX($BM$4:$BN$13,MATCH($BQ5,$BP$4:$BP$13,0),1),\" \")","v":"Book DDs"},{"$f":"IF(BR5=\"\",\"\",SUMIF($BM$4:$BM$13,BR5,$BN$4:$BN$13))","v":6},null,"Fev",4,100,98,2,"Fev",{"$f":"IFERROR(ROUNDUP(SUMIF($BU$4:$BU$20,$BZ5,$BW$4:$BW$20)/SUMIF($BU$4:$BU$20,$BZ5,$BV$4:$BV$20),0),0)","v":25},{"$f":"IFERROR(ROUNDDOWN(SUMIF($BU$4:$BU$20,$BZ5,$BX$4:$BX$20)/SUMIF($BU$4:$BU$20,$BZ5,$BV$4:$BV$20),0),0)","v":24},{"$f":"IFERROR(IF(CA5=0,0,CB5/CA5),0)","v":0.96},null,"Fev",{"$f":"SUMIF($BU$4:$BU$20,$BZ5,$BV$4:$BV$20)","v":4}]
[null,"Noite","Feminino",3,145,"Manhã",{"$f":"SUMIF($B$3:$B$20,F6,$D$3:$D$20)","v":5},null,null,"Doença Ocupacional",6,"Doença Ocupacional",6,0.35294117647058826,0.64705882352941169,null,"Queda de telhado",3,"Queda de telhado",3,null,"Fatal",3,"Fatal",3,null,"Caldeiraria",3,{"$f":"AC5+1","v":3},"Caldeiraria",3,null,"Orgãos internos",1,"Olhos",0,"","",null,3,"Olhos",0,"",{"$f":"IFERROR(IF(COUNTIF($AQ$3:AQ5,AQ6)>0,AQ6+COUNTIF($AQ$3:AQ5,AQ6),AQ6),\"\")","v":""},"",{"$f":"IF(AU6=\"\",\"\",COUNTA(AT$3:$AT5)-COUNTBLANK(AT$3:$AT5))","v":3},"Abdômen","Abdômen",1,null,"Mar",2,"Mar",2,null,null,"Power Point",6,200,158,"% de Participação",{"$f":"IF(BJ4=0,0,BJ5/BJ4)","v":0.81818181818181823},null,3,{"$f":"IFERROR(INDEX(Lista_Metodo,Apoio!BL6,1),\"\")","v":"Palestra"},6,2,{"$f":"IFERROR(IF(COUNTIF($BO$3:BO5,BO6)>0,BO6+COUNTIF($BO$3:BO5,BO6),BO6),\"\")","v":3},{"$f":"BQ5+1","v":3},"Palestra",6,null,"Mar",2,40,38,3,"Mar",20,19,0.95,null,"Mar",2]
[null,"Noite","Masculino",6,355,"Tarde",{"$f":"SUMIF($B$3:$B$20,F7,$D$3:$D$20)","v":3},null,null,null,null,"Total",{"$f":"SUM(M4:M6)","v":17},null,null,null,"Acidente de moto",3,null,null,null,"Com restrição",2,null,null,null,"Adminstrativo",1,4,"Adminstrativo",1,null,"Crânio",2,"Pescoço",1,"Pescoço",1,null,4,"Pescoço",0,"",{"$f":"IFERROR(IF(COUNTIF($AQ$3:AQ6,AQ7)>0,AQ7+COUNTIF($AQ$3:AQ6,AQ7),AQ7),\"\")","v":""},"",{"$f":"IF(AU7=\"\",\"\",COUNTA(AT$3:$AT6)-COUNTBLANK(AT$3:$AT6))","v":4},{"$f":"IFERROR(INDEX($AO$4:$AP$53,MATCH(AN7,$AS$4:$AS$53,0),1),\"\")","v":"Orgãos internos"},"Orgãos internos",1,null,"Mai",2,"Abr",2,null,null,"Vídeo",9,260,238,null,null,null,4,{"$f":"IFERROR(INDEX(Lista_Metodo,Apoio!BL7,1),\"\")","v":"Power Point"},6,2,{"$f":"IFERROR(IF(COUNTIF($BO$3:BO6,BO7)>0,BO7+COUNTIF($BO$3:BO6,BO7),BO7),\"\")","v":4},4,"Power Point",6,null,"Abr",1,30,25,4,"Abr",30,25,0.83333333333333337,null,"Abr",1]
[null,"Manhã","Masculino",5,580,"Noite",9,null,null,null,null,null,null,null,null,null,"Queda de escada",1,null,null,null,"Incapacitante",2,null,null,null,"Usinagem",1,5,"Usinagem",1,null,"Pescoço",1,"Ombro",1,"Ombro",1,null,5,"Ombro",0,"",{"$f":"IFERROR(IF(COUNTIF($AQ$3:AQ7,AQ8)>0,AQ8+COUNTIF($AQ$3:AQ7,AQ8),AQ8),\"\")","v":""},"",{"$f":"IF(AU8=\"\",\"\",COUNTA(AT$3:$AT7)-COUNTBLANK(AT$3:$AT7))","v":""},"","","",null,"Abr",2,"Mai",2,null,null,null,null,null,null,null,null,null,5,{"$f":"IFERROR(INDEX(Lista_Metodo,Apoio!BL8,1),\"\")","v":""},"","",{"$f":"IFERROR(IF(COUNTIF($BO$3:BO7,BO8)>0,BO8+COUNTIF($BO$3:BO7,BO8),BO8),\"\")","v":""},null,null,null,null,"Mai",3,120,105,5,"Mai",40,35,0.875,null,"Mai",3]
[null,null,null,null,null,"GÊNERO",null,null,null,null,null,null,null,null,null,null,"Manipulação de ferramentas",1,null,null,null,"Sem restrição",1,null,null,null,"Financeiro",1,{"$f":"AC8+1","v":6},"Financeiro",1,null,"Braço",3,"Braço",3,"Braço",3,null,6,"Braço",0,"",{"$f":"IFERROR(IF(COUNTIF($AQ$3:AQ8,AQ9)>0,AQ9+COUNTIF($AQ$3:AQ8,AQ9),AQ9),\"\")","v":""},"",{"$f":"IF(AU9=\"\",\"\",COUNTA(AT$3:$AT8)-COUNTBLANK(AT$3:$AT8))","v":""},"","","",null,"Jun",2,"Jun",2,null,null,null,null,null,null,null,null,null,6,{"$f":"IFERROR(INDEX(Lista_Metodo,Apoio!BL9,1),\"\")","v":""},"","",{"$f":"IFERROR(IF(COUNTIF($BO$3:BO8,BO9)>0,BO9+COUNTIF($BO$3:BO8,BO9),BO9),\"\")","v":""},null,null,null,null,"Jun",1,20,18,6,"Jun",20,18,0.9,null,"Jun",1]
[null,null,null,null,null,"Feminino",{"$f":"SUMIF($C$3:$C$20,F10,$D$3:$D$20)","v":5},{"$f":"IFERROR(G10/SUM($G$10:$G$11),0)","v":0.29411764705882354},null,null,null,null,null,null,null,null,null,null,null,null,null,"Não incapacitante",1,null,null,null,"Operacional",1,null,null,null,null,"Abdômen",1,"Mão",0,"","",null,7,"Cotovelo",1,2,{"$f":"IFERROR(IF(COUNTIF($AQ$3:AQ9,AQ10)>0,AQ10+COUNTIF($AQ$3:AQ9,AQ10),AQ10),\"\")","v":2},2,{"$f":"IF(AU10=\"\",\"\",COUNTA(AT$3:$AT9)-COUNTBLANK(AT$3:$AT9))","v":""},"","","",null,"Ago",1,"Jul",1,null,null,null,null,null,null,null,null,null,7,{"$f":"IFERROR(INDEX(Lista_Metodo,Apoio!BL10,1),\"\")","v":""},"","",{"$f":"IFERROR(IF(COUNTIF($BO$3:BO9,BO10)>0,BO10+COUNTIF($BO$3:BO9,BO10),BO10),\"\")","v":""},null,null,null,null,"Ago",2,110,80,7,"Jul",30,30,1,null,"Jul",1]
{"$rows_left_out":43}