{"text_format":"1","workbook":"xlsx","n_sheets":7,"sheets":["Cadastro","Programação de man. preventiva","Controle de manutenção","Ordem de serviço","Dashboard","Instruções","Apoio"],"not_rendered":{"charts":9,"images":14,"macros":1,"external_links":0,"defined_names":17,"comments":0,"pivot_tables":5},"unopened":[],"bounds":{"document_bytes":16777216,"sheet_cells":100000,"rows_first":2000,"rows_last":500,"rows_between":2000,"halvings":0,"cell_chars":16384,"cell_head_chars":4096},"cells_cut":0,"cells_raw":0,"read":"whole","date_system":"1900"}

{"sheet":"Cadastro","index":0,"n_rows":12,"n_cols":6,"rows_kept":12,"cut":false,"hidden":false,"merged":[]}
[]
[]
[]
[null,"Área",null,"Setor",null,"Equipamento"]
[null,"Mecânica",null,"Qualidade",null,"Torno vertical"]
[null,"Elétrica",null,"Ferramentaria",null,"Torno CNC"]
[null,"Eletrônica",null,"Caldeiraria",null,"Torno Convencional"]
[null,"Predial",null,"Usinagem",null,"Portal"]
[null,null,null,"Gerência",null,"Fresa CNC"]
[null,null,null,null,null,"Fresa Convencional"]
{"$rows_left_out":3}
{"sheet":"Programação de man. preventiva","index":1,"n_rows":198,"n_cols":9,"rows_kept":198,"cut":false,"hidden":false,"merged":[]}
[]
[]
[]
[null," ","Equipamento","Área de manutenção","Descrição do serviço","Data programada","Status","Mês","Ano"]
[null,null,"Torno vertical","Eletrônica","Trocar componentes do painel","2023-09-20","Pendente",{"$f":"IF(TbProgManutençãoPreventiva[[#This Row],[Data programada]]=\"\",\"\",PROPER(TEXT(TbProgManutençãoPreventiva[[#This Row],[Data programada]],\"mmm\")))","v":"Set"},{"$f":"IF(TbProgManutençãoPreventiva[[#This Row],[Data programada]]=\"\",\"\",YEAR(TbProgManutençãoPreventiva[[#This Row],[Data programada]]))","v":2023}]
[null,null,"Portal","Eletrônica","Trocar componentes do painel","2023-11-20","Pendente",{"$f":"IF(TbProgManutençãoPreventiva[[#This Row],[Data programada]]=\"\",\"\",PROPER(TEXT(TbProgManutençãoPreventiva[[#This Row],[Data programada]],\"mmm\")))","v":"Nov"},{"$f":"IF(TbProgManutençãoPreventiva[[#This Row],[Data programada]]=\"\",\"\",YEAR(TbProgManutençãoPreventiva[[#This Row],[Data programada]]))","v":2023}]
[null,null,"Fresa CNC","Elétrica","Trocar fusivel","2023-10-01","Cancelado",{"$f":"IF(TbProgManutençãoPreventiva[[#This Row],[Data programada]]=\"\",\"\",PROPER(TEXT(TbProgManutençãoPreventiva[[#This Row],[Data programada]],\"mmm\")))","v":"Out"},{"$f":"IF(TbProgManutençãoPreventiva[[#This Row],[Data programada]]=\"\",\"\",YEAR(TbProgManutençãoPreventiva[[#This Row],[Data programada]]))","v":2023}]
[null,null,"Fresa Convencional","Mecânica","Trocar rolamento","2023-07-01","Pendente",{"$f":"IF(TbProgManutençãoPreventiva[[#This Row],[Data programada]]=\"\",\"\",PROPER(TEXT(TbProgManutençãoPreventiva[[#This Row],[Data programada]],\"mmm\")))","v":"Jul"},{"$f":"IF(TbProgManutençãoPreventiva[[#This Row],[Data programada]]=\"\",\"\",YEAR(TbProgManutençãoPreventiva[[#This Row],[Data programada]]))","v":2023}]
[null,null,"Eletroerosão","Mecânica","Trocar rolamento","2023-08-05","Pendente",{"$f":"IF(TbProgManutençãoPreventiva[[#This Row],[Data programada]]=\"\",\"\",PROPER(TEXT(TbProgManutençãoPreventiva[[#This Row],[Data programada]],\"mmm\")))","v":"Ago"},{"$f":"IF(TbProgManutençãoPreventiva[[#This Row],[Data programada]]=\"\",\"\",YEAR(TbProgManutençãoPreventiva[[#This Row],[Data programada]]))","v":2023}]
[null,null,"Torno Convencional","Eletrônica","Trocar correias","2023-03-01","Finalizado",{"$f":"IF(TbProgManutençãoPreventiva[[#This Row],[Data programada]]=\"\",\"\",PROPER(TEXT(TbProgManutençãoPreventiva[[#This Row],[Data programada]],\"mmm\")))","v":"Mar"},{"$f":"IF(TbProgManutençãoPreventiva[[#This Row],[Data programada]]=\"\",\"\",YEAR(TbProgManutençãoPreventiva[[#This Row],[Data programada]]))","v":2023}]
{"$rows_left_out":189}
{"sheet":"Controle de manutenção","index":2,"n_rows":12,"n_cols":21,"rows_kept":12,"cut":false,"hidden":false,"merged":[]}
[]
[]
[]
[null," ","Nº OS","Data da solicitação","Nome do solicitante","Setor do solicitante","Grau de prioridade","Equipamento","Tipo da manutenção","Área de atuação","Descrição do defeito","Mantenedor","Data programada","Data de inicio","Data final","Status","Informações do serviço realizado","Observações","Custo total","Mês","Ano"]
[null,null,"001/2023","2023-01-01","Paulo","Ferramentaria","Baixa","Torno Convencional","Corretiva","Mecânica","Vazamento de óleo","Profissional 1","2023-05-15","2023-05-15","2020-05-20",{"$f":"IF(TbControleManutenção[[#This Row],[Data final]]<>\"\",\"Finalizado\",\nIF(AND(TbControleManutenção[[#This Row],[Data programada]]<>\"\",TbControleManutenção[[#This Row],[Data final]]=\"\"),\"Programado\",\"Pendente\"))","v":"Finalizado"},"Informações do serviço realizado 1","Observações 1",300,{"$f":"IF(TbControleManutenção[[#This Row],[Data da solicitação]]=\"\",\"\",PROPER(TEXT(TbControleManutenção[[#This Row],[Data da solicitação]],\"mmm\")))","v":"Jan"},{"$f":"IF(TbControleManutenção[[#This Row],[Data da solicitação]]=\"\",\"\",YEAR(TbControleManutenção[[#This Row],[Data da solicitação]]))","v":2023}]
[null,null,"002/2023","2023-02-01","Rogério","Qualidade","Média","Torno CNC","Preventiva","Elétrica","Máquina não liga","Profissional 1","2023-06-10","2023-06-10","2020-02-01",{"$f":"IF(TbControleManutenção[[#This Row],[Data final]]<>\"\",\"Finalizado\",\nIF(AND(TbControleManutenção[[#This Row],[Data programada]]<>\"\",TbControleManutenção[[#This Row],[Data final]]=\"\"),\"Programado\",\"Pendente\"))","v":"Finalizado"},"Informações do serviço realizado 2","Observações 2",500,{"$f":"IF(TbControleManutenção[[#This Row],[Data da solicitação]]=\"\",\"\",PROPER(TEXT(TbControleManutenção[[#This Row],[Data da solicitação]],\"mmm\")))","v":"Fev"},{"$f":"IF(TbControleManutenção[[#This Row],[Data da solicitação]]=\"\",\"\",YEAR(TbControleManutenção[[#This Row],[Data da solicitação]]))","v":2023}]
[null,null,"003/2023","2023-01-01","Nome1","Qualidade","Alta","Fresa CNC","Preventiva","Predial","Falha no sensor","Profissional 1","2023-06-12",null,null,{"$f":"IF(TbControleManutenção[[#This Row],[Data final]]<>\"\",\"Finalizado\",\nIF(AND(TbControleManutenção[[#This Row],[Data programada]]<>\"\",TbControleManutenção[[#This Row],[Data final]]=\"\"),\"Programado\",\"Pendente\"))","v":"Programado"},"Informações do serviço realizado 3","Observações 3",1000,{"$f":"IF(TbControleManutenção[[#This Row],[Data da solicitação]]=\"\",\"\",PROPER(TEXT(TbControleManutenção[[#This Row],[Data da solicitação]],\"mmm\")))","v":"Jan"},{"$f":"IF(TbControleManutenção[[#This Row],[Data da solicitação]]=\"\",\"\",YEAR(TbControleManutenção[[#This Row],[Data da solicitação]]))","v":2023}]
[null,null,"004/2023","2023-03-01","Nome2","Caldeiraria","Alta","Máquina de solda","Corretiva","Mecânica","Vazamento de óleo","Profissional 1","2023-08-01",null,null,{"$f":"IF(TbControleManutenção[[#This Row],[Data final]]<>\"\",\"Finalizado\",\nIF(AND(TbControleManutenção[[#This Row],[Data programada]]<>\"\",TbControleManutenção[[#This Row],[Data final]]=\"\"),\"Programado\",\"Pendente\"))","v":"Programado"},"Informações do serviço realizado 4","Observações 4",10000,{"$f":"IF(TbControleManutenção[[#This Row],[Data da solicitação]]=\"\",\"\",PROPER(TEXT(TbControleManutenção[[#This Row],[Data da solicitação]],\"mmm\")))","v":"Mar"},{"$f":"IF(TbControleManutenção[[#This Row],[Data da solicitação]]=\"\",\"\",YEAR(TbControleManutenção[[#This Row],[Data da solicitação]]))","v":2023}]
[null,null,"005/2023","2023-03-01","Nome3","Gerência","Alta","Máquina de solda","Corretiva","Mecânica","Barulho","Profissional 1","2023-09-01",null,null,{"$f":"IF(TbControleManutenção[[#This Row],[Data final]]<>\"\",\"Finalizado\",\nIF(AND(TbControleManutenção[[#This Row],[Data programada]]<>\"\",TbControleManutenção[[#This Row],[Data final]]=\"\"),\"Programado\",\"Pendente\"))","v":"Programado"},"Informações do serviço realizado 5","Observações 5",500,{"$f":"IF(TbControleManutenção[[#This Row],[Data da solicitação]]=\"\",\"\",PROPER(TEXT(TbControleManutenção[[#This Row],[Data da solicitação]],\"mmm\")))","v":"Mar"},{"$f":"IF(TbControleManutenção[[#This Row],[Data da solicitação]]=\"\",\"\",YEAR(TbControleManutenção[[#This Row],[Data da solicitação]]))","v":2023}]
[null,null,"006/2023","2023-05-01","Nome4","Gerência","Média","Portal","Preditiva","Mecânica","Máquina não referencia as coordenadas","Profissional 1","2023-09-10",null,null,{"$f":"IF(TbControleManutenção[[#This Row],[Data final]]<>\"\",\"Finalizado\",\nIF(AND(TbControleManutenção[[#This Row],[Data programada]]<>\"\",TbControleManutenção[[#This Row],[Data final]]=\"\"),\"Programado\",\"Pendente\"))","v":"Programado"},"Informações do serviço realizado 6","Observações 6",6000,{"$f":"IF(TbControleManutenção[[#This Row],[Data da solicitação]]=\"\",\"\",PROPER(TEXT(TbControleManutenção[[#This Row],[Data da solicitação]],\"mmm\")))","v":"Mai"},{"$f":"IF(TbControleManutenção[[#This Row],[Data da solicitação]]=\"\",\"\",YEAR(TbControleManutenção[[#This Row],[Data da solicitação]]))","v":2023}]
{"$rows_left_out":3}
{"sheet":"Ordem de serviço","index":3,"n_rows":31,"n_cols":25,"rows_kept":31,"cut":false,"hidden":false,"merged":[[3,24,3,26],[5,1,5,26],[9,1,9,26],[7,13,7,14],[7,1,7,2],[6,1,6,2],[3,5,3,22],[6,3,6,12],[7,3,7,12],[6,13,6,18],[6,19,6,26],[7,15,7,26],[10,1,10,6],[11,1,11,6],[12,1,12,6],[15,1,15,26],[10,7,10,26],[11,7,11,26],[12,7,12,26],[13,7,13,26],[13,1,13,6],[30,7,30,26],[16,7,16,26],[17,7,17,26],[18,7,18,26],[19,7,19,26],[29,1,29,26],[21,1,21,26],[22,1,28,26],[30,1,30,6],[16,1,16,6],[17,1,17,6],[18,1,18,6],[19,1,19,6]]}
[]
[]
[]
[null,null,null,null,null,"Ordem de Serviço",null,null,null,null,null,null,null,null,null,null,null,null,null,null,null,null,null,"Nº","001/2023"]
[]
[null,"Dados de solicitação"]
[null,"Data:",null,{"$f":"IFERROR(IF(INDEX(TbControleManutenção[Data da solicitação],MATCH('Ordem de serviço'!$Y$4,TbControleManutenção[Nº OS],0))=0,\"\",INDEX(TbControleManutenção[Data da solicitação],MATCH('Ordem de serviço'!$Y$4,TbControleManutenção[Nº OS],0))),\"\")","v":"2023-01-01"},null,null,null,null,null,null,null,null,null,"Grau de Prioridade:",null,null,null,null,null,{"$f":"IFERROR(IF(INDEX(TbControleManutenção[Grau de prioridade],MATCH('Ordem de serviço'!$Y$4,TbControleManutenção[Nº OS],0))=0,\"\",INDEX(TbControleManutenção[Grau de prioridade],MATCH('Ordem de serviço'!$Y$4,TbControleManutenção[Nº OS],0))),\"\")","v":"Baixa"}]
[null,"Nome:",null,{"$f":"IFERROR(IF(INDEX(TbControleManutenção[Nome do solicitante],MATCH('Ordem de serviço'!$Y$4,TbControleManutenção[Nº OS],0))=0,\"\",INDEX(TbControleManutenção[Nome do solicitante],MATCH('Ordem de serviço'!$Y$4,TbControleManutenção[Nº OS],0))),\"\")","v":"Paulo"},null,null,null,null,null,null,null,null,null,"Setor:",null,{"$f":"IFERROR(IF(INDEX(TbControleManutenção[Setor do solicitante],MATCH('Ordem de serviço'!$Y$4,TbControleManutenção[Nº OS],0))=0,\"\",INDEX(TbControleManutenção[Setor do solicitante],MATCH('Ordem de serviço'!$Y$4,TbControleManutenção[Nº OS],0))),\"\")","v":"Ferramentaria"}]
[]
[null,"Dados da manutenção"]
{"$rows_left_out":22}
{"sheet":"Dashboard","index":4,"n_rows":19,"n_cols":10,"rows_kept":19,"cut":false,"hidden":false,"merged":[]}
[]
[]
[]
[]
[]
[]
[]
[]
[]
[]
{"$rows_left_out":10}
{"sheet":"Instruções","index":5,"n_rows":46,"n_cols":2,"rows_kept":46,"cut":false,"hidden":false,"merged":[[20,1,20,7],[13,1,13,7],[16,1,16,7],[17,1,17,7],[8,1,8,7],[9,1,9,7],[10,1,10,7],[3,1,3,7],[12,1,12,7],[4,1,4,7],[5,1,5,7],[6,1,6,7],[7,1,7,7],[21,1,21,7],[24,1,24,7],[27,1,27,7],[30,1,30,7],[33,1,33,7],[22,1,22,7],[25,1,25,7],[28,1,28,7],[37,1,37,7],[41,1,41,7],[31,1,31,7],[34,1,34,7],[45,0,45,7],[35,1,35,7],[38,1,38,7],[39,1,39,7],[40,1,40,7],[42,1,42,7],[43,1,43,7],[36,1,36,7]]}
[]
[]
[]
[null,"REGRAS PARA USO"]
[null,"Muito obrigado por adquirir este produto. É uma grande satisfação tê-lo como cliente."]
[null,"Esta planilha foi planejada e desenvolvida de forma que fosse uma forma prática e fácil para conseguir controlar suas manutenções."]
[null,"Qualquer dúvida, por favor entrar em contato com : almeidaplanilhas@gmail.com"]
[]
[null,"Planilha 100% editável, para que você possa deixar do jeito que deseja."]
[]
{"$rows_left_out":37}
{"sheet":"Apoio","index":6,"n_rows":54,"n_cols":68,"rows_kept":54,"cut":false,"hidden":true,"merged":[[2,1,2,33],[2,65,2,67],[2,42,2,46],[2,35,2,40],[2,48,2,53],[2,55,2,61]]}
[]
[]
[null,"Caixas",null,null,null,null,null,null,null,null,null,null,null,null,null,null,null,null,null,null,null,null,null,null,null,null,null,null,null,null,null,null,null,null,null,"Area",null,null,null,null,null,null,"Tipos de manutenção",null,null,null,null,null,"Equip. com manutenção corretiva",null,null,null,null,null,null,"Anual",null,null,null,null,null,null,null,null,null,"Programação de manutençaõ preventiva"]
[null,"Status","Qtd","Valor","Status","Qtd","%","Legenda",null,null,"Resultado","Aprox.",null,0,0.05,0.1,0.15,0.2,0.25,0.3,0.35,0.4,0.45,0.5,0.55000000000000004,0.6,0.65,0.7,0.75,0.8,0.85,0.9,0.95,1,null,"Pos.","Área de atuação","Qtd",0,"Area","Qtd",null,"Pos.","Tipo da manutenção","Qtd","Tipo da manutenção","Qtd",null,"Pos.","Equipamento","Qtd",0,"Máquina","Qtd",null,"Mês","Qtd","Valor","Mês","Qtd.","Valor",null,"Max",null,null,null,"Data","Qtd"]
[null,"Finalizado",2,800,"Finalizado",{"$f":"SUMIF($B$5:$B$10,E5,$C$5:$C$10)","v":2},{"$f":"IF($F$8=0,0,F5/$F$8)","v":0.25},{"$f":"F5&\"/\"&$F$8","v":"2/8"},null,{"$f":"E5","v":"Finalizado"},{"$f":"G5","v":0.25},{"$f":"ROUND(K5,1)","v":0.3},null,{"$f":"IF(N$4<=$K5,0.1,NA())","v":0.1},{"$f":"IF(O$4<=$K5,0.1,NA())","v":0.1},0.1,0.1,0.1,0.1,{"$error":"#N/A"},{"$error":"#N/A"},{"$error":"#N/A"},{"$error":"#N/A"},{"$error":"#N/A"},{"$error":"#N/A"},{"$error":"#N/A"},{"$error":"#N/A"},{"$error":"#N/A"},{"$error":"#N/A"},{"$error":"#N/A"},{"$error":"#N/A"},{"$error":"#N/A"},{"$error":"#N/A"},{"$f":"IF(AH$4<=$K5,0.1,NA())","v":{"$error":"#N/A"}},null,1,"Mecânica",5,{"$f":"(4*AM4)+1","v":1},{"$f":"IF(INDEX($AK$5:$AL$24,MATCH(AM5,$AJ$5:$AJ$24,0),1)=0,\" \",INDEX($AK$5:$AL$24,MATCH(AM5,$AJ$5:$AJ$24,0),1))","v":"Mecânica"},{"$f":"IFERROR(INDEX($AK$5:$AL$24,MATCH(AN5,$AK$5:$AK$24,0),2),0)","v":5},null,1,"Corretiva",5,"Corretiva",{"$f":"IF(SUMIF($AR$5:$AR$7,AT5,$AS$5:$AS$7)=0,\"\",SUMIF($AR$5:$AR$7,AT5,$AS$5:$AS$7))","v":5},null,1,"Portal",2,{"$f":"(AZ4*5)+1","v":1},{"$f":"IF(OR(INDEX($AX$5:$AY$54,MATCH(AZ5,$AW$5:$AW$54,0),1)=0,INDEX($AX$5:$AY$54,MATCH(AZ5,$AW$5:$AW$54,0),1)=\"(vazio)\"),\" \",INDEX($AX$5:$AY$54,MATCH(AZ5,$AW$5:$AW$54,0),1))","v":"Portal"},{"$f":"IFERROR(INDEX($AX$5:$AY$54,MATCH(BA5,$AX$5:$AX$54,0),2),0)","v":2},null,"Jan",3,4300,"Jan",{"$f":"SUMIF($BD$5:$BD$16,BG5,$BE$5:$BE$16)","v":3},{"$f":"SUMIF($BD$5:$BD$16,BG5,$BF$5:$BF$16)","v":4300},{"$f":"BI5/3.2","v":1343.75},{"$f":"IF(BJ5=0,0,MAX($BJ$5:$BJ$16))","v":3281.25},{"$f":"BK5","v":3281.25},null,0,{"$f":"DATE(YEAR(NOW()),MONTH(NOW())+BN5,1)","v":"2023-07-01"},{"$f":"COUNTIFS(TbProgManutençãoPreventiva[Data programada],\">=\"&BO5,TbProgManutençãoPreventiva[Data programada],\"<=\"&EOMONTH(BO5,0),TbProgManutençãoPreventiva[Status],\"Pendente\")","v":1}]
[null,"Pendente",1,20,"Programado",{"$f":"SUMIF($B$5:$B$10,E6,$C$5:$C$10)","v":5},0.625,{"$f":"F6&\"/\"&$F$8","v":"5/8"},null,{"$f":"E6","v":"Programado"},{"$f":"G6","v":0.625},{"$f":"ROUND(K6,1)","v":0.6},null,{"$f":"IF(N$4<=$K6,0.1,NA())","v":0.1},0.1,0.1,0.1,0.1,0.1,0.1,0.1,0.1,0.1,0.1,0.1,0.1,{"$error":"#N/A"},{"$error":"#N/A"},{"$error":"#N/A"},{"$error":"#N/A"},{"$error":"#N/A"},{"$error":"#N/A"},{"$error":"#N/A"},{"$f":"IF(AH$4<=$K6,0.1,NA())","v":{"$error":"#N/A"}},null,{"$f":"AJ5+1","v":2},"Predial",1,{"$f":"AM5+1","v":2},{"$f":"IF(INDEX($AK$5:$AL$24,MATCH(AM6,$AJ$5:$AJ$24,0),1)=0,\" \",INDEX($AK$5:$AL$24,MATCH(AM6,$AJ$5:$AJ$24,0),1))","v":"Predial"},{"$f":"IFERROR(INDEX($AK$5:$AL$24,MATCH(AN6,$AK$5:$AK$24,0),2),0)","v":1},null,{"$f":"AQ5+1","v":2},"Preditiva",1,"Preditiva",{"$f":"IF(SUMIF($AR$5:$AR$7,AT6,$AS$5:$AS$7)=0,\"\",SUMIF($AR$5:$AR$7,AT6,$AS$5:$AS$7))","v":1},null,{"$f":"AW5+1","v":2},"Máquina de solda",2,{"$f":"AZ5+1","v":2},{"$f":"IF(OR(INDEX($AX$5:$AY$54,MATCH(AZ6,$AW$5:$AW$54,0),1)=0,INDEX($AX$5:$AY$54,MATCH(AZ6,$AW$5:$AW$54,0),1)=\"(vazio)\"),\" \",INDEX($AX$5:$AY$54,MATCH(AZ6,$AW$5:$AW$54,0),1))","v":"Máquina de solda"},{"$f":"IFERROR(INDEX($AX$5:$AY$54,MATCH(BA6,$AX$5:$AX$54,0),2),0)","v":2},null,"Fev",1,500,"Fev",{"$f":"SUMIF($BD$5:$BD$16,BG6,$BE$5:$BE$16)","v":1},{"$f":"SUMIF($BD$5:$BD$16,BG6,$BF$5:$BF$16)","v":500},{"$f":"BI6/3.2","v":156.25},{"$f":"IF(BJ6=0,0,MAX($BJ$5:$BJ$16))","v":3281.25},{"$f":"BK6","v":3281.25},null,{"$f":"BN5+1","v":1},{"$f":"DATE(YEAR(NOW()),MONTH(NOW())+BN6,1)","v":"2023-08-01"},{"$f":"COUNTIFS(TbProgManutençãoPreventiva[Data programada],\">=\"&BO6,TbProgManutençãoPreventiva[Data programada],\"<=\"&EOMONTH(BO6,0),TbProgManutençãoPreventiva[Status],\"Pendente\")","v":1}]
[null,"Programado",5,20500,"Pendente",1,0.125,{"$f":"F7&\"/\"&$F$8","v":"1/8"},null,{"$f":"E7","v":"Pendente"},{"$f":"G7","v":0.125},0.1,null,0.1,0.1,0.1,{"$error":"#N/A"},{"$error":"#N/A"},{"$error":"#N/A"},{"$error":"#N/A"},{"$error":"#N/A"},{"$error":"#N/A"},{"$error":"#N/A"},{"$error":"#N/A"},{"$error":"#N/A"},{"$error":"#N/A"},{"$error":"#N/A"},{"$error":"#N/A"},{"$error":"#N/A"},{"$error":"#N/A"},{"$error":"#N/A"},{"$error":"#N/A"},{"$error":"#N/A"},{"$error":"#N/A"},null,{"$f":"AJ6+1","v":3},"Elétrica",1,{"$f":"AM6+1","v":3},"Elétrica",1,null,{"$f":"AQ6+1","v":3},"Preventiva",2,"Preventiva",2,null,{"$f":"AW6+1","v":3},"Torno Convencional",1,{"$f":"AZ6+1","v":3},"Torno Convencional",1,null,"Mar",2,10500,"Mar",2,10500,3281.25,3281.25,3281.25,null,{"$f":"BN6+1","v":2},"2023-09-01",{"$f":"COUNTIFS(TbProgManutençãoPreventiva[Data programada],\">=\"&BO7,TbProgManutençãoPreventiva[Data programada],\"<=\"&EOMONTH(BO7,0),TbProgManutençãoPreventiva[Status],\"Pendente\")","v":1}]
[null,null,null,null,"Total",{"$f":"SUM(F5:F7)","v":8},{"$f":"SUM(G5:G7)","v":1},null,null,null,null,null,null,null,null,null,null,null,null,null,null,null,null,null,null,null,null,null,null,null,null,null,null,null,null,4,"Eletrônica",1,4,"Eletrônica",1,null,4,null,null,"Vazio",{"$f":"IF(SUM($AU$5:$AU$7)=0,1,NA())","v":{"$error":"#N/A"}},null,4,"Torno CNC",1,4,"Torno CNC",1,null,"Mai",1,6000,"Abr",0,0,0,0,0,null,3,"2023-10-01",{"$f":"COUNTIFS(TbProgManutençãoPreventiva[Data programada],\">=\"&BO8,TbProgManutençãoPreventiva[Data programada],\"<=\"&EOMONTH(BO8,0),TbProgManutençãoPreventiva[Status],\"Pendente\")","v":0}]
[null,null,null,null,"Valor",{"$f":"SUM($D$5:$D$11)","v":21320},null,null,null,null,"Resultado","Aprox.",null,0,0.05,0.1,0.15,0.2,0.25,0.3,0.35,0.4,0.45,0.5,0.55000000000000004,0.6,0.65,0.7,0.75,0.8,0.85,0.9,0.95,1,null,5,null,null,null,null,null,null,5,null,null,"Legenda vazio",{"$f":"IF(AU8=\"\",\"\",NA())","v":{"$error":"#N/A"}},null,5,"Eletroerosão",1,5,"Eletroerosão",1,null,"Jul",1,20,"Mai",1,6000,1875,3281.25,3281.25,null,4,"2023-11-01",{"$f":"COUNTIFS(TbProgManutençãoPreventiva[Data programada],\">=\"&BO9,TbProgManutençãoPreventiva[Data programada],\"<=\"&EOMONTH(BO9,0),TbProgManutençãoPreventiva[Status],\"Pendente\")","v":1}]
[null,null,null,null,null,null,null,null,null,{"$f":"E5","v":"Finalizado"},{"$f":"G5","v":0.25},{"$f":"ROUND(K10,1)","v":0.3},null,0.1,0.1,0.1,0.1,0.1,0.1,0.1,0.1,0.1,0.1,0.1,0.1,0.1,0.1,0.1,0.1,0.1,0.1,0.1,0.1,0.1,null,6,null,null,null,null,null,null,6,null,null,null,null,null,6,"Fresa CNC",1,null,null,null,null,null,null,null,"Jun",0,0,0,0,0,null,5,"2023-12-01",{"$f":"COUNTIFS(TbProgManutençãoPreventiva[Data programada],\">=\"&BO10,TbProgManutençãoPreventiva[Data programada],\"<=\"&EOMONTH(BO10,0),TbProgManutençãoPreventiva[Status],\"Pendente\")","v":0}]
{"$rows_left_out":44}